Reaction Details
TargetHistamine H4 receptor
LigandBDBM50356889
Substrate/Competitorn/a
Meas. Tech.ChEMBL_788365 (CHEMBL1918046)
Ki 2110±n/a nM
Citation Masood, MASelby, MDBell, ASMansfield, ACGardner, MSmith, GFLane, CKenyon-Edwards, HOsborne, RJones, RMLiu, WLBrown, CDClarke, NPerrucio, FMowbray, CE Discovery of a series of potent and selective human H4 antagonists using ligand efficiency and libraries to explore structure-activity relationship (SAR). Bioorg Med Chem Lett21:6591-5 (2011) 
 
Histamine H4 receptor
Name:Histamine H4 receptor
Type:G Protein-Coupled Receptor (GPCR)
Mol. Mass.:44517.02
Organism:Homo sapiens (Human)
Description:Binding assays were using CHO cells stably expressing hH4R receptors.
Residue:390
BDBM50356889
NameBDBM50356889
Synonyms:CHEMBL1915532
TypeSmall organic molecule
Emp. Form.C20H31N5O2
Mol. Mass.373.4924
SMILESCC(C)(C)CCNc1cc(NC2CCN(Cc3ccc(CO)o3)C2)ncn1