Reaction Details
TargetHistamine H4 receptor
LigandBDBM50357266
Substrate/Competitorn/a
Meas. Tech.ChEMBL_788365 (CHEMBL1918046)
Ki 3240±n/a nM
Citation Masood, MASelby, MDBell, ASMansfield, ACGardner, MSmith, GFLane, CKenyon-Edwards, HOsborne, RJones, RMLiu, WLBrown, CDClarke, NPerrucio, FMowbray, CE Discovery of a series of potent and selective human H4 antagonists using ligand efficiency and libraries to explore structure-activity relationship (SAR). Bioorg Med Chem Lett21:6591-5 (2011) 
 
Histamine H4 receptor
Name:Histamine H4 receptor
Type:G Protein-Coupled Receptor (GPCR)
Mol. Mass.:44517.02
Organism:Homo sapiens (Human)
Description:Binding assays were using CHO cells stably expressing hH4R receptors.
Residue:390
BDBM50357266
NameBDBM50357266
Synonyms:CHEMBL1916492
TypeSmall organic molecule
Emp. Form.C22H30N2O3
Mol. Mass.370.4852
SMILESCOc1cccc(c1)C(O)(COc1ccccc1C)CN1CCN(C)CC1