Reaction Details
TargetHistamine H4 receptor
LigandBDBM50357267
Substrate/Competitorn/a
Meas. Tech.ChEMBL_788359 (CHEMBL1918040)
Ki>2000±n/a nM
Citation Masood, MASelby, MDBell, ASMansfield, ACGardner, MSmith, GFLane, CKenyon-Edwards, HOsborne, RJones, RMLiu, WLBrown, CDClarke, NPerrucio, FMowbray, CE Discovery of a series of potent and selective human H4 antagonists using ligand efficiency and libraries to explore structure-activity relationship (SAR). Bioorg Med Chem Lett21:6591-5 (2011) 
 
Histamine H4 receptor
Name:Histamine H4 receptor
Type:G Protein-Coupled Receptor (GPCR)
Mol. Mass.:44517.02
Organism:Homo sapiens (Human)
Description:Binding assays were using CHO cells stably expressing hH4R receptors.
Residue:390
BDBM50357267
NameBDBM50357267
Synonyms:CHEMBL1916493
TypeSmall organic molecule
Emp. Form.C17H19N5O2
Mol. Mass.325.3651
SMILESCOc1ccccc1Cn1ccc(NCCc2cnc[nH]2)nc1=O