Reaction Details
TargetHistamine H4 receptor
LigandBDBM50356878
Substrate/Competitorn/a
Meas. Tech.ChEMBL_788359 (CHEMBL1918040)
Ki 572±n/a nM
Citation Masood, MASelby, MDBell, ASMansfield, ACGardner, MSmith, GFLane, CKenyon-Edwards, HOsborne, RJones, RMLiu, WLBrown, CDClarke, NPerrucio, FMowbray, CE Discovery of a series of potent and selective human H4 antagonists using ligand efficiency and libraries to explore structure-activity relationship (SAR). Bioorg Med Chem Lett21:6591-5 (2011) 
 
Histamine H4 receptor
Name:Histamine H4 receptor
Type:G Protein-Coupled Receptor (GPCR)
Mol. Mass.:44517.02
Organism:Homo sapiens (Human)
Description:Binding assays were using CHO cells stably expressing hH4R receptors.
Residue:390
BDBM50356878
NameBDBM50356878
Synonyms:CHEMBL1915534
TypeSmall organic molecule
Emp. Form.C14H25N5
Mol. Mass.263.3818
SMILESCC(C)(C)CCNc1cc(N[C@H]2CCNC2)ncn1