Reaction Details
TargetHistamine H3 receptor
LigandBDBM50357273
Substrate/Competitorn/a
Meas. Tech.ChEMBL_788369 (CHEMBL1918050)
Ki 54±n/a nM
Citation Masood, MASelby, MDBell, ASMansfield, ACGardner, MSmith, GFLane, CKenyon-Edwards, HOsborne, RJones, RMLiu, WLBrown, CDClarke, NPerrucio, FMowbray, CE Discovery of a series of potent and selective human H4 antagonists using ligand efficiency and libraries to explore structure-activity relationship (SAR). Bioorg Med Chem Lett21:6591-5 (2011) 
 
Histamine H3 receptor
Name:Histamine H3 receptor
Type:G Protein-Coupled Receptor (GPCR)
Mol. Mass.:48691.47
Organism:Homo sapiens (Human)
Description:Binding assays were using CHO cells stably expressing hH3R receptors.
Residue:445
BDBM50357273
NameBDBM50357273
Synonyms:CHEMBL1916499
TypeSmall organic molecule
Emp. Form.C15H27N5
Mol. Mass.277.4084
SMILESCN(C)[C@@H]1CCN(C1)c1cc(NCC(C)(C)C)ncn1