Reaction Details
TargetHistamine H2 receptor
LigandBDBM50356879
Substrate/Competitorn/a
Meas. Tech.ChEMBL_788363 (CHEMBL1918044)
Ki 3560±n/a nM
Citation Masood, MASelby, MDBell, ASMansfield, ACGardner, MSmith, GFLane, CKenyon-Edwards, HOsborne, RJones, RMLiu, WLBrown, CDClarke, NPerrucio, FMowbray, CE Discovery of a series of potent and selective human H4 antagonists using ligand efficiency and libraries to explore structure-activity relationship (SAR). Bioorg Med Chem Lett21:6591-5 (2011) 
 
Histamine H2 receptor
Name:Histamine H2 receptor
Type:G Protein-Coupled Receptor (GPCR)
Mol. Mass.:40115.31
Organism:Homo sapiens (Human)
Description:n/a
Residue:359
BDBM50356879
NameBDBM50356879
Synonyms:CHEMBL1915535
TypeSmall organic molecule
Emp. Form.C15H27N5
Mol. Mass.277.4084
SMILESCN1CCN(CC1)c1cc(NCCC(C)(C)C)ncn1