Reaction Details
TargetSigma non-opioid intracellular receptor 1
LigandBDBM50198061
Substrate/Competitorn/a
Meas. Tech.ChEMBL_788478 (CHEMBL1918281)
Ki 1.4±n/a nM
Citation Rossi, DPedrali, AUrbano, MGaggeri, RSerra, MFernández, LFernández, MCaballero, JRonsisvalle, SPrezzavento, OSchepmann, DWuensch, BPeviani, MCurti, DAzzolina, OCollina, S Identification of a potent and selectives¿? receptor agonist potentiating NGF-induced neurite outgrowth in PC12 cells. Bioorg Med Chem19:6210-24 (2011) 
 
Sigma non-opioid intracellular receptor 1
Name:Sigma non-opioid intracellular receptor 1
Type:Protein
Mol. Mass.:25307.17
Organism:Cavia porcellus (Guinea pig)
Description:Q60492
Residue:223
BDBM50198061
NameBDBM50198061
Synonyms:(E)-N,N-dimethyl-3-(biphen-4-yl)but-2-en-1-ylamine CHEMBL448782
TypeSmall organic molecule
Emp. Form.C18H21N
Mol. Mass.251.366
SMILESCN(C)C\C=C(/C)c1ccc(cc1)-c1ccccc1