Reaction Details
TargetHeat shock protein HSP 90-beta
LigandBDBM50357454
Substrate/Competitorn/a
Meas. Tech.ChEMBL_787204 (CHEMBL1918874)
Kd 0.35±n/a nM
Citation Vallée, FCarrez, CPilorge, FDupuy, AParent, ABertin, LThompson, FFerrari, PFassy, FLamberton, AThomas, AArrebola, RGuerif, SRohaut, ACertal, VRuxer, JMGouyon, TDelorme, CJouanen, ADumas, JGrépin, CCombeau, CGoulaouic, HDereu, NMikol, VMailliet, PMinoux, H Tricyclic series of heat shock protein 90 (Hsp90) inhibitors part I: discovery of tricyclic imidazo[4,5-c]pyridines as potent inhibitors of the Hsp90 molecular chaperone. J Med Chem54:7206-19 (2011) 
 
Heat shock protein HSP 90-beta
Name:Heat shock protein HSP 90-beta
Type:Molecular Chaperone
Mol. Mass.:83229.45
Organism:Homo sapiens (Human)
Description:P08238
Residue:724
BDBM50357454
NameBDBM50357454
Synonyms:CHEMBL1917878
TypeSmall organic molecule
Emp. Form.C27H18N6O
Mol. Mass.442.4714
SMILESO=C(N[C@@H]1c2ccccc2-c2c1cccc2-c1nc2ccncc2[nH]1)c1ccnc2[nH]ccc12