Reaction Details
TargetAromatase
LigandBDBM50357541
Substrate/Competitorn/a
Meas. Tech.ChEMBL_787696 (CHEMBL1918238)
IC50 63200±n/a nM
Citation Shen, LPark, EJKondratyuk, TPGuendisch, DMarler, LPezzuto, JMWright, ADSun, D Design, synthesis, and biological evaluation of callophycin A and analogues as potential chemopreventive and anticancer agents. Bioorg Med Chem19:6182-95 (2011) 
 
Aromatase
Name:Aromatase
Type:Enzyme
Mol. Mass.:57888.92
Organism:Homo sapiens (Human)
Description:P11511
Residue:503
BDBM50357541
NameBDBM50357541
Synonyms:CHEMBL1915156
TypeSmall organic molecule
Emp. Form.C20H20N2O4S
Mol. Mass.384.449
SMILESCOC(=O)[C@@H]1Cc2c(CN1S(=O)(=O)c1ccc(C)cc1)[nH]c1ccccc21