Reaction Details
TargetAromatase
LigandBDBM50357545
Substrate/Competitorn/a
Meas. Tech.ChEMBL_787696 (CHEMBL1918238)
IC50 72000±n/a nM
Citation Shen, LPark, EJKondratyuk, TPGuendisch, DMarler, LPezzuto, JMWright, ADSun, D Design, synthesis, and biological evaluation of callophycin A and analogues as potential chemopreventive and anticancer agents. Bioorg Med Chem19:6182-95 (2011) 
 
Aromatase
Name:Aromatase
Type:Enzyme
Mol. Mass.:57888.92
Organism:Homo sapiens (Human)
Description:P11511
Residue:503
BDBM50357545
NameBDBM50357545
Synonyms:CHEMBL1915176
TypeSmall organic molecule
Emp. Form.C16H20N2O2
Mol. Mass.272.3422
SMILESCC(C)CN1Cc2[nH]c3ccccc3c2C[C@H]1C(O)=O