Reaction Details
TargetNitric oxide synthase, inducible
LigandBDBM50230993
Substrate/Competitorn/a
Meas. Tech.ChEMBL_787699 (CHEMBL1918241)
IC50 22100±n/a nM
Citation Shen, LPark, EJKondratyuk, TPGuendisch, DMarler, LPezzuto, JMWright, ADSun, D Design, synthesis, and biological evaluation of callophycin A and analogues as potential chemopreventive and anticancer agents. Bioorg Med Chem19:6182-95 (2011) 
 
Nitric oxide synthase, inducible
Name:Nitric oxide synthase, inducible
Type:Enzyme
Mol. Mass.:130595.79
Organism:Mus musculus (mouse)
Description:Recombinant enzyme overexpressed in E. coli.
Residue:1144
BDBM50230993
NameBDBM50230993
Synonyms:(2S)-2-amino-5-[(N-methylcarbamimidoyl)amino]pentanoic acid (R)-2-Amino-5-(N'-methyl-guanidino)-pentanoic acid (S)-2-amino-5-(2-methylguanidino)pentanoic acid 2-Amino-5-(N'-methyl-guanidino)-pentanoic acid L-NMMA N(G)-mono-methyl-L-arginine N-Monomethyl-L-arginine NG-Monomethyl-L-Arginine Ngamma-monomethyl-L-arginine | Targinine
TypeSmall organic molecule
Emp. Form.C7H16N4O2
Mol. Mass.188.2275
SMILESCNC(N)=NCCC[C@H](N)C(O)=O