Reaction Details
TargetProstacyclin receptor
LigandBDBM50351485
Substrate/Competitorn/a
Meas. Tech.ChEMBL_788407 (CHEMBL1918135)
Ki 6400±n/a nM
Citation Iwahashi, MNaganawa, AKinoshita, AShimabukuro, ANishiyama, TOgawa, SMatsunaga, YTsukamoto, KOkada, YMatsumoto, RNambu, FOumi, ROdagaki, YKatagi, JYano, KTani, KNakai, HToda, M Discovery of new orally active prostaglandin D2 receptor antagonists. Bioorg Med Chem19:6935-48 (2011) 
 
Prostacyclin receptor
Name:Prostacyclin receptor
Type:G Protein-Coupled Receptor (GPCR)
Mol. Mass.:40968.22
Organism:Homo sapiens (Human)
Description:The membranes prepared from human platelet were used in binding assay.
Residue:386
BDBM50351485
NameBDBM50351485
Synonyms:CHEMBL1819603
TypeSmall organic molecule
Emp. Form.C25H24N2O5
Mol. Mass.432.4685
SMILESCN1C[C@@H](COc2ccc(cc2)C(=O)Nc2cccc(CC(O)=O)c2)Oc2ccccc12