Reaction Details
TargetProstacyclin receptor
LigandBDBM50357625
Substrate/Competitorn/a
Meas. Tech.ChEMBL_788407 (CHEMBL1918135)
Ki 2500±n/a nM
Citation Iwahashi, MNaganawa, AKinoshita, AShimabukuro, ANishiyama, TOgawa, SMatsunaga, YTsukamoto, KOkada, YMatsumoto, RNambu, FOumi, ROdagaki, YKatagi, JYano, KTani, KNakai, HToda, M Discovery of new orally active prostaglandin D2 receptor antagonists. Bioorg Med Chem19:6935-48 (2011) 
 
Prostacyclin receptor
Name:Prostacyclin receptor
Type:G Protein-Coupled Receptor (GPCR)
Mol. Mass.:40968.22
Organism:Homo sapiens (Human)
Description:The membranes prepared from human platelet were used in binding assay.
Residue:386
BDBM50357625
NameBDBM50357625
Synonyms:CHEMBL1915669
TypeSmall organic molecule
Emp. Form.C27H24N2O5
Mol. Mass.456.4899
SMILESCN1C[C@@H](COc2ccc(cc2)C(=O)n2ccc3c(CC(O)=O)cccc23)Oc2ccccc12