Reaction Details
TargetProstaglandin D2 receptor
LigandBDBM50357626
Substrate/Competitorn/a
Meas. Tech.ChEMBL_788406 (CHEMBL1918134)
Ki 6.4±n/a nM
Citation Iwahashi, MNaganawa, AKinoshita, AShimabukuro, ANishiyama, TOgawa, SMatsunaga, YTsukamoto, KOkada, YMatsumoto, RNambu, FOumi, ROdagaki, YKatagi, JYano, KTani, KNakai, HToda, M Discovery of new orally active prostaglandin D2 receptor antagonists. Bioorg Med Chem19:6935-48 (2011) 
 
Prostaglandin D2 receptor
Name:Prostaglandin D2 receptor
Type:PROTEIN
Mol. Mass.:40018.63
Organism:Mus musculus
Description:ChEMBL_788408
Residue:357
BDBM50357626
NameBDBM50357626
Synonyms:CHEMBL1915856
TypeSmall organic molecule
Emp. Form.C27H27ClN2O5
Mol. Mass.494.967
SMILESCN1C[C@@H](COc2cc(C)c(C(=O)Nc3cc(CC(O)=O)ccc3Cl)c(C)c2)Oc2ccccc12