Reaction Details
TargetProstaglandin D2 receptor
LigandBDBM50351480
Substrate/Competitorn/a
Meas. Tech.ChEMBL_788406 (CHEMBL1918134)
Ki 18±n/a nM
Citation Iwahashi, MNaganawa, AKinoshita, AShimabukuro, ANishiyama, TOgawa, SMatsunaga, YTsukamoto, KOkada, YMatsumoto, RNambu, FOumi, ROdagaki, YKatagi, JYano, KTani, KNakai, HToda, M Discovery of new orally active prostaglandin D2 receptor antagonists. Bioorg Med Chem19:6935-48 (2011) 
 
Prostaglandin D2 receptor
Name:Prostaglandin D2 receptor
Type:PROTEIN
Mol. Mass.:40018.63
Organism:Mus musculus
Description:ChEMBL_788408
Residue:357
BDBM50351480
NameBDBM50351480
Synonyms:CHEMBL1819608
TypeSmall organic molecule
Emp. Form.C26H26N2O5
Mol. Mass.446.495
SMILESCN1C[C@@H](COc2ccc(C(=O)Nc3cccc(CC(O)=O)c3)c(C)c2)Oc2ccccc12