Reaction Details
TargetProstaglandin D2 receptor
LigandBDBM50357625
Substrate/Competitorn/a
Meas. Tech.ChEMBL_788406 (CHEMBL1918134)
Ki 1700±n/a nM
Citation Iwahashi, MNaganawa, AKinoshita, AShimabukuro, ANishiyama, TOgawa, SMatsunaga, YTsukamoto, KOkada, YMatsumoto, RNambu, FOumi, ROdagaki, YKatagi, JYano, KTani, KNakai, HToda, M Discovery of new orally active prostaglandin D2 receptor antagonists. Bioorg Med Chem19:6935-48 (2011) 
 
Prostaglandin D2 receptor
Name:Prostaglandin D2 receptor
Type:PROTEIN
Mol. Mass.:40018.63
Organism:Mus musculus
Description:ChEMBL_788408
Residue:357
BDBM50357625
NameBDBM50357625
Synonyms:CHEMBL1915669
TypeSmall organic molecule
Emp. Form.C27H24N2O5
Mol. Mass.456.4899
SMILESCN1C[C@@H](COc2ccc(cc2)C(=O)n2ccc3c(CC(O)=O)cccc23)Oc2ccccc12