Reaction Details
TargetMitogen-activated protein kinase 14
LigandBDBM50357903
Substrate/Competitorn/a
Meas. Tech.ChEMBL_787640 (CHEMBL1918093)
IC50 0.490000±n/a nM
Citation Lumeras, WVidal, LVidal, BBalagué, COrellana, AMaldonado, MDomínguez, MSegarra, VCaturla, F 1,7-Naphthyridine 1-oxides as novel potent and selective inhibitors of p38 mitogen activated protein kinase. J Med Chem54:7899-910 (2011) 
 
Mitogen-activated protein kinase 14
Name:Mitogen-activated protein kinase 14
Type:Serine/threonine-protein kinase
Mol. Mass.:41286.76
Organism:Homo sapiens (Human)
Description:Q16539
Residue:360
BDBM50357903
NameBDBM50357903
Synonyms:CHEMBL1916360
TypeSmall organic molecule
Emp. Form.C25H19Cl3FN3O
Mol. Mass.502.795
SMILES[O-][n+]1ccc2c(cc(nc2c1-c1c(Cl)cccc1Cl)C1CCNCC1)-c1ccc(F)cc1Cl