Reaction Details
TargetMitogen-activated protein kinase 14
LigandBDBM50357904
Substrate/Competitorn/a
Meas. Tech.ChEMBL_787640 (CHEMBL1918093)
IC50 0.720000±n/a nM
Citation Lumeras, WVidal, LVidal, BBalagué, COrellana, AMaldonado, MDomínguez, MSegarra, VCaturla, F 1,7-Naphthyridine 1-oxides as novel potent and selective inhibitors of p38 mitogen activated protein kinase. J Med Chem54:7899-910 (2011) 
 
Mitogen-activated protein kinase 14
Name:Mitogen-activated protein kinase 14
Type:Serine/threonine-protein kinase
Mol. Mass.:41286.76
Organism:Homo sapiens (Human)
Description:Q16539
Residue:360
BDBM50357904
NameBDBM50357904
Synonyms:CHEMBL1916361
TypeSmall organic molecule
Emp. Form.C26H21Cl3FN3O
Mol. Mass.516.822
SMILESCN1CCC(CC1)c1cc(-c2ccc(F)cc2Cl)c2cc[n+]([O-])c(-c3c(Cl)cccc3Cl)c2n1