Reaction Details
TargetNuclear receptor subfamily 2 group C member 2
LigandBDBM50357884
Substrate/Competitorn/a
Meas. Tech.ChEMBL_786817 (CHEMBL1919735)
IC50>10000±n/a nM
Citation Lumeras, WVidal, LVidal, BBalagué, COrellana, AMaldonado, MDomínguez, MSegarra, VCaturla, F 1,7-Naphthyridine 1-oxides as novel potent and selective inhibitors of p38 mitogen activated protein kinase. J Med Chem54:7899-910 (2011) 
 
Nuclear receptor subfamily 2 group C member 2
Name:Nuclear receptor subfamily 2 group C member 2
Type:PROTEIN
Mol. Mass.:65411.75
Organism:Homo sapiens (Human)
Description:ChEMBL_1476357
Residue:596
BDBM50357884
NameBDBM50357884
Synonyms:CHEMBL1916359
TypeSmall organic molecule
Emp. Form.C20H10Cl3FN2O
Mol. Mass.419.664
SMILES[O-][n+]1ccc2c(ccnc2c1-c1c(Cl)cccc1Cl)-c1ccc(F)cc1Cl