Reaction Details
TargetCholinesterase
LigandBDBM50357943
Substrate/Competitorn/a
Meas. Tech.ChEMBL_787083 (CHEMBL1918573)
IC50 74±n/a nM
Citation Martins, CCarreiras, MCLeón, Rde los Ríos, CBartolini, MAndrisano, VIriepa, IMoraleda, IGálvez, EGarcía, MEgea, JSamadi, AChioua, MMarco-Contelles, J Synthesis and biological assessment of diversely substituted furo[2,3-b]quinolin-4-amine and pyrrolo[2,3-b]quinolin-4-amine derivatives, as novel tacrine analogues. Eur J Med Chem46:6119-30 (2011) 
 
Cholinesterase
Name:Cholinesterase
Type:Enzyme
Mol. Mass.:65643.35
Organism:Equus caballus (Horse)
Description:P81908
Residue:574
BDBM50357943
NameBDBM50357943
Synonyms:CHEMBL1916768
TypeSmall organic molecule
Emp. Form.C23H21N3
Mol. Mass.339.4329
SMILESNc1c2CCCCc2nc2n(c(cc12)-c1ccccc1)-c1ccccc1