Reaction Details
TargetCalpain-2 catalytic subunit
LigandBDBM50358152
Substrate/Competitorn/a
Meas. Tech.ChEMBL_788735 (CHEMBL1924666)
IC50 85±n/a nM
Citation Stuart, BGCoxon, JMMorton, JDAbell, ADMcDonald, DQAitken, SGJones, MABickerstaffe, R Molecular modeling: a search for a calpain inhibitor as a new treatment for cataractogenesis. J Med Chem54:7503-22 (2011) 
 
Calpain-2 catalytic subunit
Name:Calpain-2 catalytic subunit
Type:Protein
Mol. Mass.:79965.18
Organism:Homo sapiens (Human)
Description:n/a
Residue:700
BDBM50358152
NameBDBM50358152
Synonyms:CHEMBL1921829
TypeSmall organic molecule
Emp. Form.C28H35N3O6
Mol. Mass.509.594
SMILESCC(C)[C@@H]1NC(=O)[C@H](Cc2ccc(OCCCC[C@H](NC1=O)C=O)cc2)NC(=O)OCc1ccccc1