Reaction Details
TargetMetabotropic glutamate receptor 4
LigandBDBM50358176
Substrate/Competitorn/a
Meas. Tech.ChEMBL_788858 (CHEMBL1924928)
EC50 201±n/a nM
Citation Jones, CKEngers, DWThompson, ADField, JRBlobaum, ALLindsley, SRZhou, YGogliotti, RDJadhav, SZamorano, RBogenpohl, JSmith, YMorrison, RDaniels, JSWeaver, CDConn, PJLindsley, CWNiswender, CMHopkins, CR Discovery, synthesis, and structure-activity relationship development of a series of N-4-(2,5-dioxopyrrolidin-1-yl)phenylpicolinamides (VU0400195, ML182): characterization of a novel positive allosteric modulator of the metabotropic glutamate receptor 4 (mGlu(4)) with oral efficacy in an antiparkin J Med Chem54:7639-47 (2011) 
 
Metabotropic glutamate receptor 4
Name:Metabotropic glutamate receptor 4
Type:Enzyme
Mol. Mass.:101849.79
Organism:Rattus norvegicus (Rat)
Description:P31423
Residue:912
BDBM50358176
NameBDBM50358176
Synonyms:CHEMBL1921951
TypeSmall organic molecule
Emp. Form.C16H11N3O5S3
Mol. Mass.421.471
SMILESO=C(Nc1ccc(cc1)N1S(=O)(=O)c2ccccc2S1(=O)=O)c1nccs1