Reaction Details
TargetCytochrome P450 1A2
LigandBDBM55093
Substrate/Competitorn/a
Meas. Tech.ChEMBL_788860 (CHEMBL1924930)
IC50>30000±n/a nM
Citation Jones, CKEngers, DWThompson, ADField, JRBlobaum, ALLindsley, SRZhou, YGogliotti, RDJadhav, SZamorano, RBogenpohl, JSmith, YMorrison, RDaniels, JSWeaver, CDConn, PJLindsley, CWNiswender, CMHopkins, CR Discovery, synthesis, and structure-activity relationship development of a series of N-4-(2,5-dioxopyrrolidin-1-yl)phenylpicolinamides (VU0400195, ML182): characterization of a novel positive allosteric modulator of the metabotropic glutamate receptor 4 (mGlu(4)) with oral efficacy in an antiparkin J Med Chem54:7639-47 (2011) 
 
Cytochrome P450 1A2
Name:Cytochrome P450 1A2
Type:Enzyme
Mol. Mass.:58423.38
Organism:Homo sapiens (Human)
Description:P05177
Residue:516
BDBM55093
NameBDBM55093
Synonyms:N-[3-chloro-4-(1,3-diketo-2-azaspiro[4.5]decan-2-yl)phenyl]picolinamide N-[3-chloro-4-(1,3-dioxo-2-azaspiro[4.5]decan-2-yl)phenyl]pyridine-2-carboxamide VU0400193-3 | cid_46869951
TypeSmall organic molecule
Emp. Form.C21H20ClN3O3
Mol. Mass.397.855
SMILESClc1cc(NC(=O)c2ccccn2)ccc1N1C(=O)CC2(CCCCC2)C1=O