Reaction Details
TargetMetabotropic glutamate receptor 4
LigandBDBM50358185
Substrate/Competitorn/a
Meas. Tech.ChEMBL_788856 (CHEMBL1924926)
EC50 1800±n/a nM
Citation Jones, CKEngers, DWThompson, ADField, JRBlobaum, ALLindsley, SRZhou, YGogliotti, RDJadhav, SZamorano, RBogenpohl, JSmith, YMorrison, RDaniels, JSWeaver, CDConn, PJLindsley, CWNiswender, CMHopkins, CR Discovery, synthesis, and structure-activity relationship development of a series of N-4-(2,5-dioxopyrrolidin-1-yl)phenylpicolinamides (VU0400195, ML182): characterization of a novel positive allosteric modulator of the metabotropic glutamate receptor 4 (mGlu(4)) with oral efficacy in an antiparkin J Med Chem54:7639-47 (2011) 
 
Metabotropic glutamate receptor 4
Name:Metabotropic glutamate receptor 4
Type:Protein
Mol. Mass.:101899.95
Organism:Homo sapiens (Human)
Description:Q14833
Residue:912
BDBM50358185
NameBDBM50358185
Synonyms:CHEMBL1921955
TypeSmall organic molecule
Emp. Form.C18H15N3O4S2
Mol. Mass.401.459
SMILESO=S1(=O)N(c2ccc(NCc3ccccn3)cc2)S(=O)(=O)c2ccccc12