Reaction Details
TargetMetabotropic glutamate receptor 4
LigandBDBM55087
Substrate/Competitorn/a
Meas. Tech.ChEMBL_788856 (CHEMBL1924926)
EC50 41.9±n/a nM
Citation Jones, CKEngers, DWThompson, ADField, JRBlobaum, ALLindsley, SRZhou, YGogliotti, RDJadhav, SZamorano, RBogenpohl, JSmith, YMorrison, RDaniels, JSWeaver, CDConn, PJLindsley, CWNiswender, CMHopkins, CR Discovery, synthesis, and structure-activity relationship development of a series of N-4-(2,5-dioxopyrrolidin-1-yl)phenylpicolinamides (VU0400195, ML182): characterization of a novel positive allosteric modulator of the metabotropic glutamate receptor 4 (mGlu(4)) with oral efficacy in an antiparkin J Med Chem54:7639-47 (2011) 
 
Metabotropic glutamate receptor 4
Name:Metabotropic glutamate receptor 4
Type:Protein
Mol. Mass.:101899.95
Organism:Homo sapiens (Human)
Description:Q14833
Residue:912
BDBM55087
NameBDBM55087
Synonyms:N-[3-chloranyl-4-[4-chloranyl-1,3-bis(oxidanylidene)isoindol-2-yl]phenyl]pyridine-2-carboxamide N-[3-chloro-4-(4-chloro-1,3-dioxo-2-isoindolyl)phenyl]-2-pyridinecarboxamide VU0405623-1 | cid_46869944
TypeSmall organic molecule
Emp. Form.C20H11Cl2N3O3
Mol. Mass.412.226
SMILESClc1cccc2C(=O)N(C(=O)c12)c1ccc(NC(=O)c2ccccn2)cc1Cl