Reaction Details
TargetMetabotropic glutamate receptor 4
LigandBDBM50358187
Substrate/Competitorn/a
Meas. Tech.ChEMBL_788856 (CHEMBL1924926)
EC50 1300±n/a nM
Citation Jones, CKEngers, DWThompson, ADField, JRBlobaum, ALLindsley, SRZhou, YGogliotti, RDJadhav, SZamorano, RBogenpohl, JSmith, YMorrison, RDaniels, JSWeaver, CDConn, PJLindsley, CWNiswender, CMHopkins, CR Discovery, synthesis, and structure-activity relationship development of a series of N-4-(2,5-dioxopyrrolidin-1-yl)phenylpicolinamides (VU0400195, ML182): characterization of a novel positive allosteric modulator of the metabotropic glutamate receptor 4 (mGlu(4)) with oral efficacy in an antiparkin J Med Chem54:7639-47 (2011) 
 
Metabotropic glutamate receptor 4
Name:Metabotropic glutamate receptor 4
Type:Protein
Mol. Mass.:101899.95
Organism:Homo sapiens (Human)
Description:Q14833
Residue:912
BDBM50358187
NameBDBM50358187
Synonyms:CHEMBL1921960
TypeSmall organic molecule
Emp. Form.C20H16ClN3O4
Mol. Mass.397.812
SMILESOc1c2[C@H]3CC[C@H](O3)c2c(O)n1-c1ccc(NC(=O)c2ccccn2)cc1Cl