Reaction Details
TargetTyrosine-protein kinase ABL1
LigandBDBM50240407
Substrate/Competitorn/a
Meas. Tech.ChEMBL_790403 (CHEMBL1925856)
IC50 12700±n/a nM
Citation Lü, SLuo, QHao, XLi, XJi, LZheng, WWang, F Synthesis and docking study of 2-phenylaminopyrimidine Abl tyrosine kinase inhibitors. Bioorg Med Chem Lett21:6964-8 (2011) 
 
Tyrosine-protein kinase ABL1
Name:Tyrosine-protein kinase ABL1
Type:Enzyme
Mol. Mass.:122897.30
Organism:Homo sapiens (Human)
Description:P00519
Residue:1130
BDBM50240407
NameBDBM50240407
Synonyms:CHEMBL20926 N-[4-Methyl-3-(4-pyridin-3-yl-pyrimidin-2-ylamino)-phenyl]-benzamide
TypeSmall organic molecule
Emp. Form.C23H19N5O
Mol. Mass.381.4299
SMILESCc1ccc(NC(=O)c2ccccc2)cc1Nc1nccc(n1)-c1cccnc1