Reaction Details
TargetTyrosine-protein kinase JAK2
LigandBDBM50358914
Substrate/Competitorn/a
Meas. Tech.ChEMBL_790799 (CHEMBL1926252)
IC50 0.4±n/a nM
Citation Weinberg, LRAlbom, MSAngeles, TSBreslin, HJGingrich, DEHuang, ZLisko, JGMason, JLMilkiewicz, KLThieu, TVUnderiner, TLWells, GJWells-Knecht, KJDorsey, BD 2,7-Pyrrolo[2,1-f][1,2,4]triazines as JAK2 inhibitors: modification of target structure to minimize reactive metabolite formation. Bioorg Med Chem Lett21:7325-30 (2011) 
 
Tyrosine-protein kinase JAK2
Name:Tyrosine-protein kinase JAK2
Type:Protein
Mol. Mass.:130684.68
Organism:Homo sapiens (Human)
Description:O60674
Residue:1132
BDBM50358914
NameBDBM50358914
Synonyms:CHEMBL1923590
TypeSmall organic molecule
Emp. Form.C23H24ClN7O
Mol. Mass.449.936
SMILESCOc1ccc(cn1)-c1ccc2cnc(Nc3ccc(N4CCN(C)CC4)c(Cl)c3)nn12