Reaction Details
TargetEstrogen receptor
LigandBDBM50157155
Substrate/Competitorn/a
Meas. Tech.ChEMBL_789796 (CHEMBL1925012)
IC50 0.5±n/a nM
Citation Zhuang, SZhang, JZhang, FZhang, ZWen, YLiu, W Investigation of the diastereomerism of dihydrobenzoxathiin SERMs for ER alpha by molecular modeling. Bioorg Med Chem Lett21:7298-305 (2011) 
 
Estrogen receptor
Name:Estrogen receptor
Type:Protein
Mol. Mass.:66230.44
Organism:Homo sapiens (Human)
Description:P03372
Residue:595
BDBM50157155
NameBDBM50157155
Synonyms:(2S,3R)-3-(4-Hydroxy-phenyl)-2-[4-((R)-3-methyl-2-pyrrolidin-1-yl-butoxy)-phenyl]-2,3-dihydro-benzo[1,4]oxathiin-6-ol | CHEMBL182794
TypeSmall organic molecule
Emp. Form.C29H33NO4S
Mol. Mass.491.642
SMILESCC(C)[C@H](COc1ccc(cc1)[C@@H]1Oc2ccc(O)cc2S[C@@H]1c1ccc(O)cc1)N1CCCC1