Reaction Details
TargetPotassium voltage-gated channel subfamily H member 2
LigandBDBM50359195
Substrate/Competitorn/a
Meas. Tech.ChEMBL_789985 (CHEMBL1924167)
Ki 47000±n/a nM
Citation Chen, AAspiotis, RCampeau, LCCauchon, EChefson, ADucharme, YFalgueyret, JPGagné, SHan, YHoule, RLaliberté, SLarouche, GLévesque, JFMcKay, DPercival, D Renin inhibitors for the treatment of hypertension: design and optimization of a novel series of spirocyclic piperidines. Bioorg Med Chem Lett21:7399-404 (2011) 
 
Potassium voltage-gated channel subfamily H member 2
Name:Potassium voltage-gated channel subfamily H member 2
Type:Multi-pass membrane protein
Mol. Mass.:126672.65
Organism:Homo sapiens (Human)
Description:Q12809
Residue:1159
BDBM50359195
NameBDBM50359195
Synonyms:CHEMBL1923132
TypeSmall organic molecule
Emp. Form.C34H42ClF2N3O5
Mol. Mass.646.164
SMILESCOCCCc1cc(CCC(=O)N2CCOCC2)c(Cl)c(CN(C2CC2)C(=O)[C@H]2CNCC[C@@]22OCc3cc(F)c(F)cc23)c1