Reaction Details
TargetP2X purinoceptor 7
LigandBDBM50359231
Substrate/Competitorn/a
Meas. Tech.ChEMBL_790225 (CHEMBL1925618)
IC50 50±n/a nM
Citation Brumfield, SMatasi, JJTulshian, DCzarniecki, MGreenlee, WGarlisi, CQiu, HDevito, KChen, SCSun, YBertorelli, RAnsell, JGeiss, WLe, VDMartin, GSVellekoop, SAHaber, JAllard, ML Synthesis and SAR development of novel P2X7 receptor antagonists for the treatment of pain: part 2. Bioorg Med Chem Lett21:7287-90 (2011) 
 
P2X purinoceptor 7
Name:P2X purinoceptor 7
Type:Protein
Mol. Mass.:68602.85
Organism:Homo sapiens (Human)
Description:Q99572
Residue:595
BDBM50359231
NameBDBM50359231
Synonyms:CHEMBL1923323
TypeSmall organic molecule
Emp. Form.C30H28F2N6O2
Mol. Mass.542.5791
SMILESCCN1C2=NC(C)(C)CN2c2c(nc(-c3ccc(nc3)-c3ccc(OC)cc3)n2Cc2ccc(F)c(F)c2)C1=O