Reaction Details
TargetMitogen-activated protein kinase 14
LigandBDBM50359319
Substrate/Competitorn/a
Meas. Tech.ChEMBL_794350 (CHEMBL1932272)
IC50 220±n/a nM
Citation Moffett, KKonteatis, ZNguyen, DShetty, RLudington, JFujimoto, TLee, KJChai, XNamboodiri, HKarpusas, MDorsey, BGuarnieri, FBukhtiyarova, MSpringman, EMichelotti, E Discovery of a novel class of non-ATP site DFG-out state p38 inhibitors utilizing computationally assisted virtual fragment-based drug design (vFBDD). Bioorg Med Chem Lett21:7155-65 (2011) 
 
Mitogen-activated protein kinase 14
Name:Mitogen-activated protein kinase 14
Type:Serine/threonine-protein kinase
Mol. Mass.:41286.76
Organism:Homo sapiens (Human)
Description:Q16539
Residue:360
BDBM50359319
NameBDBM50359319
Synonyms:CHEMBL1929198
TypeSmall organic molecule
Emp. Form.C24H29N3O3S2
Mol. Mass.471.635
SMILESCC(C)(C)c1cc(CN2CCS(=O)(=O)CC2)c(NC(=O)Nc2cccc3ccccc23)s1