Reaction Details
TargetMitogen-activated protein kinase 14
LigandBDBM50359349
Substrate/Competitorn/a
Meas. Tech.ChEMBL_794350 (CHEMBL1932272)
IC50 80±n/a nM
Citation Moffett, KKonteatis, ZNguyen, DShetty, RLudington, JFujimoto, TLee, KJChai, XNamboodiri, HKarpusas, MDorsey, BGuarnieri, FBukhtiyarova, MSpringman, EMichelotti, E Discovery of a novel class of non-ATP site DFG-out state p38 inhibitors utilizing computationally assisted virtual fragment-based drug design (vFBDD). Bioorg Med Chem Lett21:7155-65 (2011) 
 
Mitogen-activated protein kinase 14
Name:Mitogen-activated protein kinase 14
Type:Serine/threonine-protein kinase
Mol. Mass.:41286.76
Organism:Homo sapiens (Human)
Description:Q16539
Residue:360
BDBM50359349
NameBDBM50359349
Synonyms:CHEMBL1929228
TypeSmall organic molecule
Emp. Form.C22H28N4O3S
Mol. Mass.428.548
SMILESCc1cccc(NC(=O)Nc2sc(cc2C(=O)N2CCNC(=O)CC2)C(C)(C)C)c1