Reaction Details
TargetPhosphorylase b kinase gamma catalytic chain, liver/testis isoform
LigandBDBM50359359
Substrate/Competitorn/a
Meas. Tech.ChEMBL_793941 (CHEMBL1931533)
IC50>30000±n/a nM
Citation Moffett, KKonteatis, ZNguyen, DShetty, RLudington, JFujimoto, TLee, KJChai, XNamboodiri, HKarpusas, MDorsey, BGuarnieri, FBukhtiyarova, MSpringman, EMichelotti, E Discovery of a novel class of non-ATP site DFG-out state p38 inhibitors utilizing computationally assisted virtual fragment-based drug design (vFBDD). Bioorg Med Chem Lett21:7155-65 (2011) 
 
Phosphorylase b kinase gamma catalytic chain, liver/testis isoform
Name:Phosphorylase b kinase gamma catalytic chain, liver/testis isoform
Type:PROTEIN
Mol. Mass.:46440.15
Organism:Homo sapiens (Human)
Description:ChEMBL_774277
Residue:406
BDBM50359359
NameBDBM50359359
Synonyms:CHEMBL1929238
TypeSmall organic molecule
Emp. Form.C25H33Cl2N5O3S
Mol. Mass.554.532
SMILESCN(C)CCN1CCN(CCC1=O)C(=O)c1cc(sc1NC(=O)Nc1cccc(Cl)c1Cl)C(C)(C)C