Reaction Details
TargetTyrosine-protein kinase BTK
LigandBDBM50359359
Substrate/Competitorn/a
Meas. Tech.ChEMBL_794371 (CHEMBL1932336)
IC50>30000±n/a nM
Citation Moffett, KKonteatis, ZNguyen, DShetty, RLudington, JFujimoto, TLee, KJChai, XNamboodiri, HKarpusas, MDorsey, BGuarnieri, FBukhtiyarova, MSpringman, EMichelotti, E Discovery of a novel class of non-ATP site DFG-out state p38 inhibitors utilizing computationally assisted virtual fragment-based drug design (vFBDD). Bioorg Med Chem Lett21:7155-65 (2011) 
 
Tyrosine-protein kinase BTK
Name:Tyrosine-protein kinase BTK
Type:Enzyme
Mol. Mass.:76289.95
Organism:Homo sapiens (Human)
Description:Q06187
Residue:659
BDBM50359359
NameBDBM50359359
Synonyms:CHEMBL1929238
TypeSmall organic molecule
Emp. Form.C25H33Cl2N5O3S
Mol. Mass.554.532
SMILESCN(C)CCN1CCN(CCC1=O)C(=O)c1cc(sc1NC(=O)Nc1cccc(Cl)c1Cl)C(C)(C)C