Reaction Details
TargetPeroxisome proliferator-activated receptor alpha
LigandBDBM28681
Substrate/Competitorn/a
Meas. Tech.ChEMBL_792686 (CHEMBL1930422)
EC50>1000±n/a nM
Citation Ciocoiu, CCRavna, AWSylte, IRustan, ACHansen, TV Synthesis, molecular modeling studies and biological evaluation of fluorine substituted analogs of GW 501516. Bioorg Med Chem19:6982-8 (2011) 
 
Peroxisome proliferator-activated receptor alpha
Name:Peroxisome proliferator-activated receptor alpha
Type:Enzyme
Mol. Mass.:52222.08
Organism:Homo sapiens (Human)
Description:Q07869
Residue:468
BDBM28681
NameBDBM28681
Synonyms:5-[(4-{2-[methyl(pyridin-2-yl)amino]ethoxy}phenyl)methyl]-1,3-thiazolidine-2,4-dione BRL 49653 CHEMBL121 [3H]rosiglitazone rosiglitazone
Typeradiolabeled ligand
Emp. Form.C18H19N3O3S
Mol. Mass.357.427
SMILESCN(CCOc1ccc(Cc2sc(=O)[nH]c2O)cc1)c1ccccn1