Reaction Details
TargetCytochrome P450 1A2
LigandBDBM50359617
Substrate/Competitorn/a
Meas. Tech.ChEMBL_793295 (CHEMBL1931744)
IC50>10000±n/a nM
Citation Xin, ZPeng, HZhang, ATalreja, TKumaravel, GXu, LRohde, EJung, MYShackett, MNKocisko, DChollate, SDunah, AWSnodgrass-Belt, PAArnold, HMTaveras, AGRhodes, KJScannevin, RH Discovery of 4-aminomethylphenylacetic acids as¿-secretase modulators via a scaffold design approach. Bioorg Med Chem Lett21:7277-80 (2011) 
 
Cytochrome P450 1A2
Name:Cytochrome P450 1A2
Type:Enzyme
Mol. Mass.:58423.38
Organism:Homo sapiens (Human)
Description:P05177
Residue:516
BDBM50359617
NameBDBM50359617
Synonyms:CHEMBL1928243
TypeSmall organic molecule
Emp. Form.C27H31F6NO2
Mol. Mass.515.531
SMILESCC(C)(C)CC(N1CCC(CC1)C(F)(F)F)c1ccc(CC(O)=O)cc1-c1ccc(cc1)C(F)(F)F