Reaction Details
TargetThymidylate kinase
LigandBDBM50359619
Substrate/Competitorn/a
Meas. Tech.ChEMBL_793312 (CHEMBL1931815)
Ki 15000±n/a nM
Citation Van Poecke, SMunier-Lehmann, HHelynck, OFroeyen, MVan Calenbergh, S Synthesis and inhibitory activity of thymidine analogues targeting Mycobacterium tuberculosis thymidine monophosphate kinase. Bioorg Med Chem19:7603-11 (2011) 
 
Thymidylate kinase
Name:Thymidylate kinase
Type:PROTEIN
Mol. Mass.:22636.29
Organism:Mycobacterium tuberculosis
Description:ChEMBL_208218
Residue:214
BDBM50359619
NameBDBM50359619
Synonyms:CHEMBL1928429
TypeSmall organic molecule
Emp. Form.C18H18ClN5O3S
Mol. Mass.419.885
SMILESCc1cn([C@H]2C[C@@H]([C@@H](CO)O2)n2cc(nn2)-c2ccc(Cl)cc2)c(=O)[nH]c1=S