Reaction Details
TargetThymidylate kinase
LigandBDBM50359625
Substrate/Competitorn/a
Meas. Tech.ChEMBL_793312 (CHEMBL1931815)
Ki 170±n/a nM
Citation Van Poecke, SMunier-Lehmann, HHelynck, OFroeyen, MVan Calenbergh, S Synthesis and inhibitory activity of thymidine analogues targeting Mycobacterium tuberculosis thymidine monophosphate kinase. Bioorg Med Chem19:7603-11 (2011) 
 
Thymidylate kinase
Name:Thymidylate kinase
Type:PROTEIN
Mol. Mass.:22636.29
Organism:Mycobacterium tuberculosis
Description:ChEMBL_208218
Residue:214
BDBM50359625
NameBDBM50359625
Synonyms:CHEMBL1928435
TypeSmall organic molecule
Emp. Form.C18H18ClF3N4O3S2
Mol. Mass.494.939
SMILESCc1cn([C@@H]2C[C@H](O)[C@@H](CNC(=S)Nc3ccc(Cl)c(c3)C(F)(F)F)O2)c(=O)[nH]c1=S