Reaction Details
TargetSerine/threonine-protein kinase Chk1
LigandBDBM50359814
Substrate/Competitorn/a
Meas. Tech.ChEMBL_791990 (CHEMBL1930050)
IC50 17±n/a nM
Citation Reader, JCMatthews, TPKlair, SCheung, KMScanlon, JProisy, NAddison, GEllard, JPiton, NTaylor, SCherry, MFisher, MBoxall, KBurns, SWalton, MIWestwood, IMHayes, AEve, PValenti, Mde Haven Brandon, ABox, Gvan Montfort, RLWilliams, DHAherne, GWRaynaud, FIEccles, SAGarrett, MDCollins, I Structure-guided evolution of potent and selective CHK1 inhibitors through scaffold morphing. J Med Chem54:8328-42 (2011) 
 
Serine/threonine-protein kinase Chk1
Name:Serine/threonine-protein kinase Chk1
Type:Enzyme Catalytic Domain
Mol. Mass.:54443.02
Organism:Homo sapiens (Human)
Description:gi_166295192
Residue:476
BDBM50359814
NameBDBM50359814
Synonyms:CHEMBL1928697
TypeSmall organic molecule
Emp. Form.C20H20N6O
Mol. Mass.360.4124
SMILESN#Cc1ncc(Nc2cc3ccccc3cn2)nc1OCC1CCNCC1