Reaction Details
TargetProstaglandin G/H synthase 1
LigandBDBM50360022
Substrate/Competitorn/a
Meas. Tech.ChEMBL_793699 (CHEMBL1932513)
IC50 42000±n/a nM
Citation Rogosch, TSinning, CPodlewski, AWatzer, BSchlosburg, JLichtman, AHCascio, MGBisogno, TDi Marzo, VNüsing, RImming, P Novel bioactive metabolites of dipyrone (metamizol). Bioorg Med Chem20:101-7 (2011) 
 
Prostaglandin G/H synthase 1
Name:Prostaglandin G/H synthase 1
Type:PROTEIN
Mol. Mass.:69044.61
Organism:Mus musculus
Description:ChEMBL_10575
Residue:602
BDBM50360022
NameBDBM50360022
Synonyms:CHEMBL1928336
TypeSmall organic molecule
Emp. Form.C32H45N3O2
Mol. Mass.503.7186
SMILESCCCCC\C=C/C\C=C/C\C=C/C\C=C/CCCC(=O)N(C)c1c(C)n(C)n(-c2ccccc2)c1=O