Reaction Details
TargetCannabinoid receptor 2
LigandBDBM50360022
Substrate/Competitorn/a
Meas. Tech.ChEMBL_793706 (CHEMBL1932520)
Ki 3000±n/a nM
Citation Rogosch, TSinning, CPodlewski, AWatzer, BSchlosburg, JLichtman, AHCascio, MGBisogno, TDi Marzo, VNüsing, RImming, P Novel bioactive metabolites of dipyrone (metamizol). Bioorg Med Chem20:101-7 (2011) 
 
Cannabinoid receptor 2
Name:Cannabinoid receptor 2
Type:G Protein-Coupled Receptor (GPCR)
Mol. Mass.:39690.94
Organism:Homo sapiens (Human)
Description:P34972
Residue:360
BDBM50360022
NameBDBM50360022
Synonyms:CHEMBL1928336
TypeSmall organic molecule
Emp. Form.C32H45N3O2
Mol. Mass.503.7186
SMILESCCCCC\C=C/C\C=C/C\C=C/C\C=C/CCCC(=O)N(C)c1c(C)n(C)n(-c2ccccc2)c1=O