Reaction Details
TargetCannabinoid receptor 2
LigandBDBM50360023
Substrate/Competitorn/a
Meas. Tech.ChEMBL_793706 (CHEMBL1932520)
Ki 5400±n/a nM
Citation Rogosch, TSinning, CPodlewski, AWatzer, BSchlosburg, JLichtman, AHCascio, MGBisogno, TDi Marzo, VNüsing, RImming, P Novel bioactive metabolites of dipyrone (metamizol). Bioorg Med Chem20:101-7 (2011) 
 
Cannabinoid receptor 2
Name:Cannabinoid receptor 2
Type:G Protein-Coupled Receptor (GPCR)
Mol. Mass.:39690.94
Organism:Homo sapiens (Human)
Description:P34972
Residue:360
BDBM50360023
NameBDBM50360023
Synonyms:CHEMBL1928337
TypeSmall organic molecule
Emp. Form.C31H43N3O2
Mol. Mass.489.692
SMILESCCCCC\C=C/C\C=C/C\C=C/C\C=C/CCCC(=O)Nc1c(C)n(C)n(-c2ccccc2)c1=O