Reaction Details
TargetHypoxanthine-guanine phosphoribosyltransferase
LigandBDBM50360110
Substrate/Competitorn/a
Meas. Tech.ChEMBL_793806 (CHEMBL1932721)
Ki>100000±n/a nM
Citation Cesnek, MHocková, DHolý, ADracínský, MBaszczynski, OJersey, JdKeough, DTGuddat, LW Synthesis of 9-phosphonoalkyl and 9-phosphonoalkoxyalkyl purines: evaluation of their ability to act as inhibitors of Plasmodium falciparum, Plasmodium vivax and human hypoxanthine-guanine-(xanthine) phosphoribosyltransferases. Bioorg Med Chem20:1076-89 (2012) 
 
Hypoxanthine-guanine phosphoribosyltransferase
Name:Hypoxanthine-guanine phosphoribosyltransferase
Type:Protein
Mol. Mass.:24579.61
Organism:Homo sapiens (Human)
Description:P00492
Residue:218
BDBM50360110
NameBDBM50360110
Synonyms:CHEMBL1928779
TypeSmall organic molecule
Emp. Form.C8H12N5O4P
Mol. Mass.273.1857
SMILESNc1nc2n(CCCP(O)(O)=O)cnc2c(=O)[nH]1