Reaction Details
TargetHypoxanthine-guanine phosphoribosyltransferase
LigandBDBM50360116
Substrate/Competitorn/a
Meas. Tech.ChEMBL_793806 (CHEMBL1932721)
Ki 3000±n/a nM
Citation Cesnek, MHocková, DHolý, ADracínský, MBaszczynski, OJersey, JdKeough, DTGuddat, LW Synthesis of 9-phosphonoalkyl and 9-phosphonoalkoxyalkyl purines: evaluation of their ability to act as inhibitors of Plasmodium falciparum, Plasmodium vivax and human hypoxanthine-guanine-(xanthine) phosphoribosyltransferases. Bioorg Med Chem20:1076-89 (2012) 
 
Hypoxanthine-guanine phosphoribosyltransferase
Name:Hypoxanthine-guanine phosphoribosyltransferase
Type:Protein
Mol. Mass.:24579.61
Organism:Homo sapiens (Human)
Description:P00492
Residue:218
BDBM50360116
NameBDBM50360116
Synonyms:CHEMBL1928783
TypeSmall organic molecule
Emp. Form.C9H14N5O5P
Mol. Mass.303.2117
SMILESNc1nc2n(COCCCP(O)(O)=O)cnc2c(=O)[nH]1