Reaction Details
TargetHypoxanthine-guanine phosphoribosyltransferase
LigandBDBM50360122
Substrate/Competitorn/a
Meas. Tech.ChEMBL_793806 (CHEMBL1932721)
Ki 1900±n/a nM
Citation Cesnek, MHocková, DHolý, ADracínský, MBaszczynski, OJersey, JdKeough, DTGuddat, LW Synthesis of 9-phosphonoalkyl and 9-phosphonoalkoxyalkyl purines: evaluation of their ability to act as inhibitors of Plasmodium falciparum, Plasmodium vivax and human hypoxanthine-guanine-(xanthine) phosphoribosyltransferases. Bioorg Med Chem20:1076-89 (2012) 
 
Hypoxanthine-guanine phosphoribosyltransferase
Name:Hypoxanthine-guanine phosphoribosyltransferase
Type:Protein
Mol. Mass.:24579.61
Organism:Homo sapiens (Human)
Description:P00492
Residue:218
BDBM50360122
NameBDBM50360122
Synonyms:CHEMBL1928777
TypeSmall organic molecule
Emp. Form.C6H7N4O4P
Mol. Mass.230.1179
SMILESOP(O)(=O)Cn1cnc2c1nc[nH]c2=O