Reaction Details
TargetEpidermal growth factor receptor
LigandBDBM50360174
Substrate/Competitorn/a
Meas. Tech.ChEMBL_793571 (CHEMBL1932339)
IC50>50000±n/a nM
Citation Gangjee, AKurup, SIhnat, MAThorpe, JEDisch, B N¿?¿-Aryl-6-substitutedphenylmethyl-7H-pyrrolo[2,3-d]pyrimidine-2,4-diamines as receptor tyrosine kinase inhibitors. Bioorg Med Chem20:910-4 (2012) 
 
Epidermal growth factor receptor
Name:Epidermal growth factor receptor
Type:Receptor Kinase Domain
Mol. Mass.:134279.59
Organism:Homo sapiens (Human)
Description:P00533
Residue:1210
BDBM50360174
NameBDBM50360174
Synonyms:CHEMBL1929552
TypeSmall organic molecule
Emp. Form.C20H17ClFN5
Mol. Mass.381.834
SMILESCc1ccccc1Cc1cc2c(Nc3ccc(Cl)cc3F)nc(N)nc2[nH]1