Reaction Details
TargetEpidermal growth factor receptor
LigandBDBM50360178
Substrate/Competitorn/a
Meas. Tech.ChEMBL_793571 (CHEMBL1932339)
IC50 112700±n/a nM
Citation Gangjee, AKurup, SIhnat, MAThorpe, JEDisch, B N¿?¿-Aryl-6-substitutedphenylmethyl-7H-pyrrolo[2,3-d]pyrimidine-2,4-diamines as receptor tyrosine kinase inhibitors. Bioorg Med Chem20:910-4 (2012) 
 
Epidermal growth factor receptor
Name:Epidermal growth factor receptor
Type:Receptor Kinase Domain
Mol. Mass.:134279.59
Organism:Homo sapiens (Human)
Description:P00533
Residue:1210
BDBM50360178
NameBDBM50360178
Synonyms:CHEMBL1929556
TypeSmall organic molecule
Emp. Form.C21H19ClFN5O2
Mol. Mass.427.859
SMILESCOc1ccc(OC)c(Cc2cc3c(Nc4ccc(Cl)cc4F)nc(N)nc3[nH]2)c1