Reaction Details
TargetVascular endothelial growth factor receptor 1
LigandBDBM50318183
Substrate/Competitorn/a
Meas. Tech.ChEMBL_793573 (CHEMBL1932341)
IC50 45900±n/a nM
Citation Gangjee, AKurup, SIhnat, MAThorpe, JEDisch, B N¿?¿-Aryl-6-substitutedphenylmethyl-7H-pyrrolo[2,3-d]pyrimidine-2,4-diamines as receptor tyrosine kinase inhibitors. Bioorg Med Chem20:910-4 (2012) 
 
Vascular endothelial growth factor receptor 1
Name:Vascular endothelial growth factor receptor 1
Type:Receptor Tyrosine Kinase
Mol. Mass.:150800.23
Organism:Homo sapiens (Human)
Description:P17948
Residue:1338
BDBM50318183
NameBDBM50318183
Synonyms:CHEMBL1095465 | N4-(3-bromophenyl)-6-(2,5-dimethoxybenzyl)-7H-pyrrolo[2,3-d]pyrimidine-2,4-diamine
TypeSmall organic molecule
Emp. Form.C21H20BrN5O2
Mol. Mass.454.32
SMILESCOc1ccc(OC)c(Cc2cc3c(Nc4cccc(Br)c4)nc(N)nc3[nH]2)c1