Reaction Details
TargetVascular endothelial growth factor receptor 1
LigandBDBM50360175
Substrate/Competitorn/a
Meas. Tech.ChEMBL_793573 (CHEMBL1932341)
IC50>200000±n/a nM
Citation Gangjee, AKurup, SIhnat, MAThorpe, JEDisch, B N¿?¿-Aryl-6-substitutedphenylmethyl-7H-pyrrolo[2,3-d]pyrimidine-2,4-diamines as receptor tyrosine kinase inhibitors. Bioorg Med Chem20:910-4 (2012) 
 
Vascular endothelial growth factor receptor 1
Name:Vascular endothelial growth factor receptor 1
Type:Receptor Tyrosine Kinase
Mol. Mass.:150800.23
Organism:Homo sapiens (Human)
Description:P17948
Residue:1338
BDBM50360175
NameBDBM50360175
Synonyms:CHEMBL1929553
TypeSmall organic molecule
Emp. Form.C20H18ClN5
Mol. Mass.363.843
SMILESCc1ccccc1Cc1cc2c(Nc3ccc(Cl)cc3)nc(N)nc2[nH]1